Target
Kappa-type opioid receptor
Ligand
BDBM86518
Substrate
Ki
183±n/a nM
Comments
PDSP_669
Citation
 Gilbert, AKHosztafi, SMahurter, LPasternak, GW Pharmacological characterization of dihydromorphine, 6-acetyldihydromorphine and dihydroheroin analgesia and their differentiation from morphine. Eur J Pharmacol 492:123-30 (2004)  
Target
Name:
Kappa-type opioid receptor
Synonyms:
Kappa Opioid Receptor OPRK1 Opiate Kappa 1 | mu/kappa opioid receptor
Type:
G Protein-Coupled Receptor (GPCR)
Mol. Mass.:
42744.99
Organism:
Cavia porcellus (domestic guinea pig)
Description:
P41144
Residue:
380
  
Inhibitor
Name:
BDBM86518
Synonyms:
CAS_509-60-4 NSC_273032
Type:
Small organic molecule
Emp. Form.:
C17H21NO3
Mol. Mass.:
287.3535
SMILES:
CN1CCC23C4Oc5c2c(CC1C3CCC4O)ccc5O
: