Target
Mitogen-activated protein kinase 9
Ligand
BDBM86630
Substrate
Meas. Tech.
JNK Kinase Assay
IC50
1.93±0.0 nM
Citation
 Zhang, TInesta-Vaquera, FNiepel, MZhang, JFicarro, SBMachleidt, TXie, TMarto, JAKim, NSim, TLaughlin, JDPark, HLoGrasso, PVPatricelli, MNomanbhoy, TKSorger, PKAlessi, DRGray, NS Discovery of potent and selective covalent inhibitors of JNK. Chem Biol 19:140-54 (2012)  
Target
Name:
Mitogen-activated protein kinase 9
Synonyms:
JNK-55 JNK2/JNK3 MK09_HUMAN Mitogen-activated protein kinase 8/9 SAPK1A c-Jun N-terminal kinase 2 | c-Jun N-terminal kinase 2 (JNK2)
Type:
Enzyme
Mol. Mass.:
48131.49
Organism:
Homo sapiens (Human)
Description:
JNK-2 was purchased from Upstate Cell Signaling Solutions (formerly Upstate Biotechnology).
Residue:
424
  
Inhibitor
Name:
BDBM86630
Synonyms:
JNK-IN-5
Type:
Small organic molecule
Emp. Form.:
C25H20N6O2
Mol. Mass.:
436.4653
SMILES:
C=CC(=O)Nc1cccc(c1)C(=O)Nc1ccc(Nc2nccc(n2)-c2cccnc2)cc1
: