Target
Inhibitor of nuclear factor kappa-B kinase subunit epsilon
Ligand
BDBM278020
Substrate
Meas. Tech.
TBK1 and IKKE Biological Assays
pH
7±n/a
IC50
1000±n/a nM
Comments
extracted
Citation
 Du, ZGuerrero, JAKaplan, JAKnox, Jr., JELo, JRMitchell, SANaduthambi, DPhillips, BWVenkataramani, CWang, PWatkins, WJZhao, Z Tank-binding kinase inhibitor compounds US Patent  US10040781 Publication Date 8/7/2018 
Target
Name:
Inhibitor of nuclear factor kappa-B kinase subunit epsilon
Synonyms:
I kappa-B kinase epsilon I-kappa-B kinase epsilon (IKK-E) IKBKE IKK-epsilon IKKE IKKI KIAA0151 | von Hippel-Lindau disease tumor suppressor/Inhibitor of nuclear factor kappa-B kinase subunit epsilon
Type:
Serine/threonine-protein kinase
Mol. Mass.:
80475.98
Organism:
Homo sapiens (Human)
Description:
Kinase inhibitory activity was determined using recombinant human IKK-epsilon expressed in baculovirus as a FLAG-tagged fusion protein.
Residue:
716
  
Inhibitor
Name:
BDBM278020
Synonyms:
2-(((3R,4S)-3-fluoro-1-(2-hydroxyacetyl)piperidin-4-yl)oxy)-5-(4-((4-((R)-2-methyl-4-(oxetan-3-yl)piperazin-1-yl)phenyl)amino)-1,3,5-triazin-2-yl)benzonitrile US10253019, Example 242
Type:
Small organic molecule
Emp. Form.:
C31H35FN8O4
Mol. Mass.:
602.6592
SMILES:
C[C@@H]1CN(CCN1c1ccc(Nc2ncnc(n2)-c2ccc(O[C@H]3CCN(C[C@H]3F)C(=O)CO)c(c2)C#N)cc1)C1COC1
: