Target
Metabotropic glutamate receptor 5
Ligand
BDBM86716
Substrate
Ki
58±n/a nM
Comments
PDSP_4884
Citation
 Porter, RHJaeschke, GSpooren, WBallard, TMBüttelmann, BKolczewski, SPeters, JUPrinssen, EWichmann, JVieira, EMühlemann, AGatti, SMutel, VMalherbe, P Fenobam: a clinically validated nonbenzodiazepine anxiolytic is a potent, selective, and noncompetitive mGlu5 receptor antagonist with inverse agonist activity. J Pharmacol Exp Ther 315:711-21 (2005)  
Target
Name:
Metabotropic glutamate receptor 5
Synonyms:
GPRC1E GRM5_HUMAN metabotropic glutamate 5 | metabotropic glutamate 5a
Type:
Enzyme
Mol. Mass.:
132484.72
Organism:
Homo sapiens (Human)
Description:
Residue:
1212
  
Inhibitor
Name:
BDBM86716
Synonyms:
CAS_63540-28-3 Fenobam | NSC_216215
Type:
Small organic molecule
Emp. Form.:
C11H11ClN4O2
Mol. Mass.:
266.684
SMILES:
Cn1cc(O)nc1NC(=O)Nc1cccc(Cl)c1
: