Target
Neuropeptide Y receptor type 1
Ligand
BDBM86733
Substrate
Ki
>10000±n/a nM
Comments
PDSP_6329
Citation
 Kakui, NTanaka, JTabata, YAsai, KMasuda, NMiyara, TNakatani, YOhsawa, FNishikawa, NSugai, MSuzuki, MAoki, KKitaguchi, H Pharmacological characterization and feeding-suppressive property of FMS586 [3-(5,6,7,8-tetrahydro-9-isopropyl-carbazol-3-yl)-1-methyl-1-(2-pyridin-4-yl-ethyl)-urea hydrochloride], a novel, selective, and orally active antagonist for neuropeptide Y Y5 receptor. J Pharmacol Exp Ther 317:562-70 (2006)  
Target
Name:
Neuropeptide Y receptor type 1
Synonyms:
NPY-Y1 NPY1R NPYR neuropeptide Y receptor Y1
Type:
Enzyme Catalytic Domain
Mol. Mass.:
44399.07
Organism:
Homo sapiens (Human)
Description:
NPY-Y1 NPY1R HUMAN::P25929
Residue:
384
  
Inhibitor
Name:
BDBM86733
Synonyms:
5,5-DIMETHYL-2-(2,3,4,9-TETRAHYDRO-3,3-DIMETHYL-1OXO-1H-XANTHEN-9-YL)-1,3-CYCLOHEXANEDIONE CHEMBL491762 | L-152,804
Type:
Small organic molecule
Emp. Form.:
C23H26O4
Mol. Mass.:
366.4501
SMILES:
CC1(C)CC(=O)C(C2C3=C(CC(C)(C)CC3=O)Oc3ccccc23)C(=O)C1
: