Target
Neuropeptide Y receptor type 5
Ligand
BDBM86733
Substrate
Ki
25±n/a nM
Comments
PDSP_6329
Citation
 Kakui, NTanaka, JTabata, YAsai, KMasuda, NMiyara, TNakatani, YOhsawa, FNishikawa, NSugai, MSuzuki, MAoki, KKitaguchi, H Pharmacological characterization and feeding-suppressive property of FMS586 [3-(5,6,7,8-tetrahydro-9-isopropyl-carbazol-3-yl)-1-methyl-1-(2-pyridin-4-yl-ethyl)-urea hydrochloride], a novel, selective, and orally active antagonist for neuropeptide Y Y5 receptor. J Pharmacol Exp Ther 317:562-70 (2006)  
Target
Name:
Neuropeptide Y receptor type 5
Synonyms:
NPY-Y5 NPY5-R NPY5R_HUMAN NPYY5 Neuropeptide Y receptor type 5 ( NPY Y5) | Y5 receptor
Type:
Enzyme
Mol. Mass.:
50746.64
Organism:
Homo sapiens (Human)
Description:
Q15761
Residue:
445
  
Inhibitor
Name:
BDBM86733
Synonyms:
5,5-DIMETHYL-2-(2,3,4,9-TETRAHYDRO-3,3-DIMETHYL-1OXO-1H-XANTHEN-9-YL)-1,3-CYCLOHEXANEDIONE CHEMBL491762 | L-152,804
Type:
Small organic molecule
Emp. Form.:
C23H26O4
Mol. Mass.:
366.4501
SMILES:
CC1(C)CC(=O)C(C2C3=C(CC(C)(C)CC3=O)Oc3ccccc23)C(=O)C1
: