Target
Tyrosine-protein kinase Lyn
Ligand
BDBM13530
Substrate
Ki
8376±n/a nM
Comments
PDSP_6372
Citation
 Melnick, JSJanes, JKim, SChang, JYSipes, DGGunderson, DJarnes, LMatzen, JTGarcia, MEHood, TLBeigi, RXia, GHarig, RAAsatryan, HYan, SFZhou, YGu, XJSaadat, AZhou, VKing, FJShaw, CMSu, AIDowns, RGray, NSSchultz, PGWarmuth, MCaldwell, JS An efficient rapid system for profiling the cellular activities of molecular libraries. Proc Natl Acad Sci U S A 103:3153-8 (2006)  
Target
Name:
Tyrosine-protein kinase Lyn
Synonyms:
JTK8 LYN_HUMAN Tyrosine-protein kinase Lyn (LYN) p53Lyn | p56Lyn
Type:
Protein
Mol. Mass.:
58575.92
Organism:
Homo sapiens (Human)
Description:
P07948
Residue:
512
  
Inhibitor
Name:
BDBM13530
Synonyms:
4-[(4-methylpiperazin-1-yl)methyl]-N-[4-methyl-3-[(4-pyridin-3-ylpyrimidin-2-yl)amino]phenyl]benzamide Gleevec Imatinib, 21 STI-571 US10906896, Cpd imatinib US11725005, Compound imatinib cid_5291 med.21724, Compound 6
Type:
Small organic molecule
Emp. Form.:
C29H31N7O
Mol. Mass.:
493.6027
SMILES:
CN1CCN(Cc2ccc(cc2)C(=O)Nc2ccc(C)c(Nc3nccc(n3)-c3cccnc3)c2)CC1
: