Target
Epidermal growth factor receptor
Ligand
BDBM3727
Substrate
EGF-R Substrate
Meas. Tech.
Kinase Inhibition Assay
IC50
0.45±n/a nM
Citation
 Rewcastle, GWMurray, DKElliott, WLFry, DWHoward, CTNelson, JMRoberts, BJVincent, PWShowalter, HDWinters, RTDenny, WA Tyrosine kinase inhibitors. 14. Structure-activity relationships for methylamino-substituted derivatives of 4-[(3-bromophenyl)amino]-6-(methylamino)-pyrido[3,4-d]pyrimidine (PD 158780), a potent and specific inhibitor of the tyrosine kinase activity of receptors for the EGF family of growth factors. J Med Chem 41:742-51 (1998)  
Target
Name:
Epidermal growth factor receptor
Synonyms:
EGF Receptor Substrate EGFR_HUMAN ERBB1 Epidermal Growth Factor Receptor erbB-1 Epidermal growth factor receptor (EGFR) HER1 Proto-oncogene c-ErbB-1 Tyrosine-Protein Kinase ErbB-1
Type:
Receptor Kinase Domain
Mol. Mass.:
134279.59
Organism:
Homo sapiens (Human)
Description:
P00533
Residue:
1210
  
Inhibitor
Name:
BDBM3727
Synonyms:
6-(Methylamino)-4-[(3-methylphenyl)amino]pyrido[3,4-d]pyrimidine PD158780 Analog 9b
Type:
Small organic molecule
Emp. Form.:
C15H15N5
Mol. Mass.:
265.3131
SMILES:
CNc1cc2c(Nc3cccc(C)c3)ncnc2cn1
:
Substrate
Name:
EGF-R Substrate
Synonyms:
Type:
Peptide
Mol. Mass.:
4119.23
Organism:
Description:
The sequence is based on a portion of phospholipase C-gamma. 10 uM ATP containing 1 uCi of [gamma-32P]ATP as co-substrate.
Residue:
38