Target
Nuclear receptor coactivator 3
Ligand
BDBM87257
Substrate
Meas. Tech.
Luminescence-based cell-based high throughput dose response assay for inhibitors of the Steroid Receptor Coactivator 3 (SRC3; NCOA3)
IC50
>11955±n/a nM
Citation
 PubChem, PC Luminescence-based cell-based high throughput dose response assay for inhibitors of the Steroid Receptor Coactivator 3 (SRC3; NCOA3) PubChem Bioassay (2012)[AID] 
Target
Name:
Nuclear receptor coactivator 3
Synonyms:
AIB1 NCOA3 RAC3 nuclear receptor coactivator 3 isoform a
Type:
Enzyme Catalytic Domain
Mol. Mass.:
155305.29
Organism:
Homo sapiens (Human)
Description:
Q9Y6Q9
Residue:
1424
  
Inhibitor
Name:
BDBM87257
Synonyms:
1-(3-acetylphenyl)-3-(3-keto-4-methyl-1,4-benzothiazin-6-yl)urea 1-(3-ethanoylphenyl)-3-(4-methyl-3-oxidanylidene-1,4-benzothiazin-6-yl)urea N-(3-acetylphenyl)-N'-(4-methyl-3-oxo-3,4-dihydro-2H-1,4-benzothiazin-6-yl)urea cid_3243309
Type:
Small organic molecule
Emp. Form.:
C18H17N3O3S
Mol. Mass.:
355.411
SMILES:
CN1C(=O)CSc2ccc(NC(=O)Nc3cccc(c3)C(C)=O)cc12
: