Target
Nuclear receptor coactivator 3
Ligand
BDBM63948
Substrate
Meas. Tech.
Luminescence-based cell-based high throughput dose response assay for inhibitors of the Steroid Receptor Coactivator 3 (SRC3; NCOA3)
IC50
33933±n/a nM
Citation
 PubChem, PC Luminescence-based cell-based high throughput dose response assay for inhibitors of the Steroid Receptor Coactivator 3 (SRC3; NCOA3) PubChem Bioassay (2012)[AID] 
Target
Name:
Nuclear receptor coactivator 3
Synonyms:
AIB1 NCOA3 RAC3 nuclear receptor coactivator 3 isoform a
Type:
Enzyme Catalytic Domain
Mol. Mass.:
155305.29
Organism:
Homo sapiens (Human)
Description:
Q9Y6Q9
Residue:
1424
  
Inhibitor
Name:
BDBM63948
Synonyms:
(E)-3-(2,5-dimethoxyanilino)-1-phenyl-2-propen-1-one (E)-3-(2,5-dimethoxyanilino)-1-phenylprop-2-en-1-one 3-[(2,5-dimethoxyphenyl)amino]-1-phenyl-2-propen-1-one SMR000497263 | cid_2291569
Type:
Small organic molecule
Emp. Form.:
C17H17NO3
Mol. Mass.:
283.3218
SMILES:
COc1ccc(OC)c(c1)N=CCC(=O)c1ccccc1
: