Target
Nuclear receptor coactivator 1
Ligand
BDBM87257
Substrate
Meas. Tech.
Counterscreen for inhibitors of the Steroid Receptor Coactivator 3 (SRC3; NCOA3)
IC50
20016±n/a nM
Citation
 PubChem, PC Counterscreen for inhibitors of the Steroid Receptor Coactivator 3 (SRC3; NCOA3): Luminescence-based cell-based high throughput dose response assay to identify inhibitors of the Steroid Receptor Coactivator 1 (SRC1; NCOA1) PubChem Bioassay (2012)[AID] 
Target
Name:
Nuclear receptor coactivator 1
Synonyms:
BHLHE74 NCOA1 NCoA-1 Protein Hin-2 Renal carcinoma antigen NY-REN-52 SRC1 nuclear receptor coactivator 1 isoform 1
Type:
PROTEIN
Mol. Mass.:
156749.34
Organism:
Homo sapiens (Human)
Description:
ChEMBL_759690
Residue:
1441
  
Inhibitor
Name:
BDBM87257
Synonyms:
1-(3-acetylphenyl)-3-(3-keto-4-methyl-1,4-benzothiazin-6-yl)urea 1-(3-ethanoylphenyl)-3-(4-methyl-3-oxidanylidene-1,4-benzothiazin-6-yl)urea N-(3-acetylphenyl)-N'-(4-methyl-3-oxo-3,4-dihydro-2H-1,4-benzothiazin-6-yl)urea cid_3243309
Type:
Small organic molecule
Emp. Form.:
C18H17N3O3S
Mol. Mass.:
355.411
SMILES:
CN1C(=O)CSc2ccc(NC(=O)Nc3cccc(c3)C(C)=O)cc12
: