Target
Nuclear receptor coactivator 1
Ligand
BDBM63948
Substrate
Meas. Tech.
Counterscreen for inhibitors of the Steroid Receptor Coactivator 3 (SRC3; NCOA3)
IC50
33790±n/a nM
Citation
 PubChem, PC Counterscreen for inhibitors of the Steroid Receptor Coactivator 3 (SRC3; NCOA3): Luminescence-based cell-based high throughput dose response assay to identify inhibitors of the Steroid Receptor Coactivator 1 (SRC1; NCOA1) PubChem Bioassay (2012)[AID] 
Target
Name:
Nuclear receptor coactivator 1
Synonyms:
BHLHE74 NCOA1 NCoA-1 Protein Hin-2 Renal carcinoma antigen NY-REN-52 SRC1 nuclear receptor coactivator 1 isoform 1
Type:
PROTEIN
Mol. Mass.:
156749.34
Organism:
Homo sapiens (Human)
Description:
ChEMBL_759690
Residue:
1441
  
Inhibitor
Name:
BDBM63948
Synonyms:
(E)-3-(2,5-dimethoxyanilino)-1-phenyl-2-propen-1-one (E)-3-(2,5-dimethoxyanilino)-1-phenylprop-2-en-1-one 3-[(2,5-dimethoxyphenyl)amino]-1-phenyl-2-propen-1-one SMR000497263 | cid_2291569
Type:
Small organic molecule
Emp. Form.:
C17H17NO3
Mol. Mass.:
283.3218
SMILES:
COc1ccc(OC)c(c1)N=CCC(=O)c1ccccc1
: