Target
Fibroblast growth factor receptor 3
Ligand
BDBM278498
Substrate
IC50
<100±n/a nM
Citation
 Sun, YLu, LYao, WHe, CZhang, F Bicyclic heterocycles as FGFR inhibitors US Patent  US10040790 Publication Date 8/7/2018 
Target
Name:
Fibroblast growth factor receptor 3
Synonyms:
CD_antigen: CD333 FGFR3 Fibroblast growth factor receptor JTK4
Type:
Protein
Mol. Mass.:
87699.57
Organism:
Homo sapiens (Human)
Description:
P22607
Residue:
806
  
Inhibitor
Name:
BDBM278498
Synonyms:
7-amino-3-(2,6-difluoro-3,5-dimethoxyphenyl)-1-methyl-8-phenyl-3,4-dihydropyrido[4,3-d]pyrimidin-2(1H)-one US10450313, Example 14 US11530214, Example 14
Type:
Small organic molecule
Emp. Form.:
C22H20F2N4O3
Mol. Mass.:
426.416
SMILES:
COc1cc(OC)c(F)c(N2Cc3cnc(N)c(-c4ccccc4)c3N(C)C2=O)c1F
: