Target
Melanocortin receptor 4
Ligand
BDBM75439
Substrate
Meas. Tech.
Luminescence-based cell-based high throughput dose response assay for biased ligands (agonists) of the melanocortin 4 receptor (MC4R)
EC50
>89191±n/a nM
Citation
 PubChem, PC Luminescence-based cell-based high throughput dose response assay for biased ligands (agonists) of the melanocortin 4 receptor (MC4R) PubChem Bioassay (2012)[AID] 
Target
Name:
Melanocortin receptor 4
Synonyms:
MC4-R MC4R_HUMAN Melanocortin receptor 4 (MC-4) Melanocortin receptor 4 (MC4R)
Type:
Enzyme
Mol. Mass.:
36949.50
Organism:
Homo sapiens (Human)
Description:
P32245
Residue:
332
  
Inhibitor
Name:
BDBM75439
Synonyms:
MLS002473625 SMR001397792 dimethyl-[2-[4-(2-phenylbenzothiophen-3-yl)phenoxy]ethyl]amine
Type:
Small organic molecule
Emp. Form.:
C24H23NOS
Mol. Mass.:
373.511
SMILES:
CN(C)CCOc1ccc(cc1)-c1c(sc2ccccc12)-c1ccccc1
: