Target
Tyrosine-protein phosphatase non-receptor type 11
Ligand
BDBM46225
Substrate
Meas. Tech.
Dose Response selectivity of inhibitors of Striatal-Enriched Phosphatase (STEP) in a SHP2 (PTPN11) Inhibition Assay
IC50
1080±n/a nM
Citation
 PubChem, PC Dose Response selectivity of inhibitors of Striatal-Enriched Phosphatase (STEP) in a SHP2 (PTPN11) Inhibition Assay PubChem Bioassay (2012)[AID] 
Target
Name:
Tyrosine-protein phosphatase non-receptor type 11
Synonyms:
3.1.3.48 PTP-1D PTP2C Protein Tyrosine Phosphatase PPN11/Shp2 Protein-Tyrosine Phosphatase SHP-2 Protein-tyrosine phosphatase 2C SH-PTP3 SHP2 Src homology phosphatase 2 (SHP-2) Tyrosine-protein phosphatase non-receptor type 11 (SHP-2) | Tyrosine-protein phosphatase non-receptor type 11 (SHP2)
Type:
Protein phosphatase
Mol. Mass.:
68443.59
Organism:
Homo sapiens (Human)
Description:
Q06124
Residue:
593
  
Inhibitor
Name:
BDBM46225
Synonyms:
MLS-0266851.0001 | cid_2545467
Type:
Small organic molecule
Emp. Form.:
C23H18N2O7S2
Mol. Mass.:
498.528
SMILES:
CCOC(=O)c1sc2nc3c(SCC(O)=O)cc(cn3c(=O)c2c1C)C(=O)c1ccccc1O
: