Target
26S proteasome non-ATPase regulatory subunit 14
Ligand
BDBM89004
Substrate
Meas. Tech.
Dose response confirmation of uHTS RPN11 inhibitor hits in a Fluorescence Polarization assay
IC50
33100±3240 nM
Citation
 PubChem, PC Dose response confirmation of uHTS RPN11 inhibitor hits in a Fluorescence Polarization assay PubChem Bioassay (2012)[AID] 
Target
Name:
26S proteasome non-ATPase regulatory subunit 14
Synonyms:
26S Proteasome regulatory subunit Rpn11 (Rpn11) PSDE_HUMAN PSMD14 protein
Type:
Protein
Mol. Mass.:
34576.68
Organism:
Homo sapiens (Human)
Description:
O00487
Residue:
310
  
Inhibitor
Name:
BDBM89004
Synonyms:
3-(4-keto-5,6,7,8-tetrahydro-3H-benzothiopheno[2,3-d]pyrimidin-2-yl)-N-(2-methoxyphenyl)propionamide N-(2-methoxyphenyl)-3-(4-oxidanylidene-5,6,7,8-tetrahydro-3H-[1]benzothiolo[2,3-d]pyrimidin-2-yl)propanamide SMR000708280 | cid_17538600
Type:
Small organic molecule
Emp. Form.:
C20H21N3O3S
Mol. Mass.:
383.464
SMILES:
COc1ccccc1NC(=O)CCc1nc2sc3CCCCc3c2c(=O)[nH]1
: