Target
Prothrombin
Ligand
BDBM48851
Substrate
Meas. Tech.
Dose Response validation of uHTS RPN11 inhibitor hits using a Thrombin Fluorescence Polarization assay
IC50
50500±2620 nM
Citation
 PubChem, PC Dose Response validation of uHTS RPN11 inhibitor hits using a Thrombin Fluorescence Polarization assay PubChem Bioassay (2012)[AID] 
Target
Name:
Prothrombin
Synonyms:
Activation peptide fragment 1 Coagulation factor II Prothrombin Thrombin Thrombin light chain
Type:
Enzyme
Mol. Mass.:
70502.73
Organism:
Bos taurus (Bovine)
Description:
P00735
Residue:
625
  
Inhibitor
Name:
BDBM48851
Synonyms:
2-[6-(2-fluorobenzyl)-4-keto-5,7-dimethyl-pyrrolo[3,4-d]pyridazin-3-yl]-N-(2,3,5,6-tetrafluorophenyl)acetamide 2-[6-[(2-fluorophenyl)methyl]-5,7-dimethyl-4-oxidanylidene-pyrrolo[3,4-d]pyridazin-3-yl]-N-[2,3,5,6-tetrakis(fluoranyl)phenyl]ethanamide 2-[6-[(2-fluorophenyl)methyl]-5,7-dimethyl-4-oxopyrrolo[3,4-d]pyridazin-3-yl]-N-(2,3,5,6-tetrafluorophenyl)acetamide SMR000310114 | cid_16194171
Type:
Small organic molecule
Emp. Form.:
C23H17F5N4O2
Mol. Mass.:
476.3987
SMILES:
Cc1n(Cc2ccccc2F)c(C)c2c1cnn(CC(=O)Nc1c(F)c(F)cc(F)c1F)c2=O
: