Target
Tyrosine-protein phosphatase non-receptor type 5
Ligand
BDBM34462
Substrate
Meas. Tech.
Dose response confirmation of uHTS small molecule inhibitors of Striatal-Enriched Phosphatase via a fluorescence intensity assay
IC50
8950±n/a nM
Citation
 PubChem, PC Dose response confirmation of uHTS small molecule inhibitors of Striatal-Enriched Phosphatase via a fluorescence intensity assay PubChem Bioassay (2012)[AID] 
Target
Name:
Tyrosine-protein phosphatase non-receptor type 5
Synonyms:
PTN5_HUMAN Tyrosine-protein phosphatase non-receptor type 5 | Tyrosine-protein phosphatase non-receptor type 5 isoform a
Type:
Enzyme Catalytic Domain
Mol. Mass.:
63510.68
Organism:
Homo sapiens (Human)
Description:
gi_90652859
Residue:
565
  
Inhibitor
Name:
BDBM34462
Synonyms:
(3,4-dichlorophenyl)-[4-(2-hydroxyethyl)-1-piperazinyl]methanethione (3,4-dichlorophenyl)-[4-(2-hydroxyethyl)piperazino]methanethione MLS000049575 cid_963027
Type:
Small organic molecule
Emp. Form.:
C13H16Cl2N2OS
Mol. Mass.:
319.25
SMILES:
OCCN1CCN(CC1)C(=S)c1ccc(Cl)c(Cl)c1
: