Target
Tyrosine-protein phosphatase non-receptor type 5
Ligand
BDBM82711
Substrate
Meas. Tech.
Dose response confirmation of uHTS small molecule inhibitors of Striatal-Enriched Phosphatase via a fluorescence intensity assay
IC50
17300±n/a nM
Citation
 PubChem, PC Dose response confirmation of uHTS small molecule inhibitors of Striatal-Enriched Phosphatase via a fluorescence intensity assay PubChem Bioassay (2012)[AID] 
Target
Name:
Tyrosine-protein phosphatase non-receptor type 5
Synonyms:
PTN5_HUMAN Tyrosine-protein phosphatase non-receptor type 5 | Tyrosine-protein phosphatase non-receptor type 5 isoform a
Type:
Enzyme Catalytic Domain
Mol. Mass.:
63510.68
Organism:
Homo sapiens (Human)
Description:
gi_90652859
Residue:
565
  
Inhibitor
Name:
BDBM82711
Synonyms:
MLS000581278 N-[4-[(3-phenylpropanoylamino)carbamoyl]phenyl]benzamide N-[4-[oxo-[(1-oxo-3-phenylpropyl)hydrazo]methyl]phenyl]benzamide cid_2207747
Type:
Small organic molecule
Emp. Form.:
C23H21N3O3
Mol. Mass.:
387.4311
SMILES:
O=C(CCc1ccccc1)NNC(=O)c1ccc(NC(=O)c2ccccc2)cc1
: