Target
Dual specificity protein phosphatase 3
Ligand
BDBM50459
Substrate
Meas. Tech.
Dose Response selectivity of inhibitors of STriatal-Enriched Phosphatase (STEP) in the dual-specificity protein-tyrosine phosphatase VHR Inhibition Assay
IC50
2730±n/a nM
Citation
 PubChem, PC Dose Response selectivity of inhibitors of STriatal-Enriched Phosphatase (STEP) in the dual-specificity protein-tyrosine phosphatase VHR Inhibition Assay PubChem Bioassay (2012)[AID] 
Target
Name:
Dual specificity protein phosphatase 3
Synonyms:
DUS3_HUMAN Dual specificity protein phosphatase (VHR) Dual specificity protein phosphatase VHR Tyrosine-protein phosphatase non-receptor type 1 | VHR
Type:
Hydrolase
Mol. Mass.:
20480.58
Organism:
Homo sapiens (Human)
Description:
Residue:
185
  
Inhibitor
Name:
BDBM50459
Synonyms:
MLS000862518 N-[4-[(3,4-dimethyl-1,2-oxazol-5-yl)sulfamoyl]phenyl]-6,8-dimethyl-2-pyridin-2-yl-quinoline-4-carboxamide N-[4-[(3,4-dimethyl-5-isoxazolyl)sulfamoyl]phenyl]-6,8-dimethyl-2-(2-pyridinyl)-4-quinolinecarboxamide SMR000300559 | cid_1261822
Type:
Small organic molecule
Emp. Form.:
C28H25N5O4S
Mol. Mass.:
527.594
SMILES:
Cc1noc(NS(=O)(=O)c2ccc(NC(=O)c3cc(nc4c(C)cc(C)cc34)-c3ccccn3)cc2)c1C
: