Target
DNA (cytosine-5)-methyltransferase 1
Ligand
BDBM61894
Substrate
Meas. Tech.
Dose response confirmation of DNMT1 inhibitors in a Fluorescent Molecular Beacon assay
IC50
9080±577 nM
Citation
 PubChem, PC Dose response confirmation of DNMT1 inhibitors in a Fluorescent Molecular Beacon assay PubChem Bioassay (2012)[AID] 
Target
Name:
DNA (cytosine-5)-methyltransferase 1
Synonyms:
AIM CXXC9 DNA (cytosine-5)-methyltransferase 1 isoform b DNA methyltransferase HsaI DNMT1 M.HsaI | MCMT
Type:
Enzyme
Mol. Mass.:
183184.85
Organism:
Homo sapiens (Human)
Description:
P26358
Residue:
1616
  
Inhibitor
Name:
BDBM61894
Synonyms:
MLS002164959 N-(4-ethoxy-3-morpholin-4-ylsulfonylphenyl)-3-pyrrol-1-ylbenzamide N-[4-ethoxy-3-(4-morpholinylsulfonyl)phenyl]-3-(1-pyrrolyl)benzamide cid_16318005
Type:
Small organic molecule
Emp. Form.:
C23H25N3O5S
Mol. Mass.:
455.527
SMILES:
CCOc1ccc(NC(=O)c2cccc(c2)-n2cccc2)cc1S(=O)(=O)N1CCOCC1
: