Target
Beta-2 adrenergic receptor
Ligand
BDBM84215
Substrate
Meas. Tech.
Dose response for HTS for Beta-2AR agonists via FAP method from Powderset2
EC50
1370±n/a nM
Citation
 PubChem, PC Dose response for HTS for Beta-2AR agonists via FAP method from Powderset2 PubChem Bioassay (2012)[AID] 
Target
Name:
Beta-2 adrenergic receptor
Synonyms:
ADRB2 ADRB2_HUMAN Beta-2 adrenoceptor | Beta-2 adrenoreceptor
Type:
Mol. Mass.:
46461.69
Organism:
Homo sapiens (Human)
Description:
P07550
Residue:
413
  
Inhibitor
Name:
BDBM84215
Synonyms:
4-[[1-oxo-2-[4-(1-pyrrolidinylsulfonyl)phenoxy]ethyl]amino]benzoic acid ethyl ester 4-{2-[4-(Pyrrolidine-1-sulfonyl)-phenoxy]-acetylamino}-benzoic acid ethyl ester SMR000124597 ethyl 4-[2-(4-pyrrolidin-1-ylsulfonylphenoxy)ethanoylamino]benzoate | ethyl 4-[[2-(4-pyrrolidin-1-ylsulfonylphenoxy)acetyl]amino]benzoate
Type:
Small organic molecule
Emp. Form.:
C21H24N2O6S
Mol. Mass.:
432.49
SMILES:
CCOC(=O)c1ccc(NC(=O)COc2ccc(cc2)S(=O)(=O)N2CCCC2)cc1
: