Target
Beta-2 adrenergic receptor
Ligand
BDBM75784
Substrate
Meas. Tech.
Dose response for HTS for Beta-2AR agonists via FAP method from Powderset3
EC50
8090±n/a nM
Citation
 PubChem, PC Dose response for HTS for Beta-2AR agonists via FAP method from Powderset3 PubChem Bioassay (2012)[AID] 
Target
Name:
Beta-2 adrenergic receptor
Synonyms:
ADRB2 ADRB2_HUMAN Beta-2 adrenoceptor | Beta-2 adrenoreceptor
Type:
Mol. Mass.:
46461.69
Organism:
Homo sapiens (Human)
Description:
P07550
Residue:
413
  
Inhibitor
Name:
BDBM75784
Synonyms:
2-[[5-(3-chlorophenyl)-4-(furan-2-ylmethyl)-1,2,4-triazol-3-yl]sulfanylmethyl]-1H-benzimidazole 2-[[[5-(3-chlorophenyl)-4-(2-furfuryl)-1,2,4-triazol-3-yl]thio]methyl]-1H-benzimidazole SMR000048506 | cid_667188
Type:
Small organic molecule
Emp. Form.:
C21H16ClN5OS
Mol. Mass.:
421.903
SMILES:
Clc1cccc(c1)-c1nnc(SCc2nc3ccccc3[nH]2)n1Cc1ccco1
: