Target
Mitochondrial peptide methionine sulfoxide reductase
Ligand
BDBM55750
Substrate
Meas. Tech.
Absorbance-based biochemical high throughput dose response assay for activators of Methionine sulfoxide reductase A (MsrA)
EC50
>103971±n/a nM
Citation
 PubChem, PC Absorbance-based biochemical high throughput dose response assay for activators of Methionine sulfoxide reductase A (MsrA) PubChem Bioassay (2012)[AID] 
Target
Name:
Mitochondrial peptide methionine sulfoxide reductase
Synonyms:
MSRA MSRA_BOVIN
Type:
Enzyme Catalytic Domain
Mol. Mass.:
25822.90
Organism:
Bos taurus
Description:
gi_73586699
Residue:
233
  
Inhibitor
Name:
BDBM55750
Synonyms:
5-(2-phenylethylamino)-3H-1,3,4-thiadiazole-2-thione CHEMBL290545 SMR000289534 | cid_2916953
Type:
Small organic molecule
Emp. Form.:
C10H11N3S2
Mol. Mass.:
237.344
SMILES:
Sc1nnc(NCCc2ccccc2)s1
: