Target
Tyrosine-protein phosphatase non-receptor type 5
Ligand
BDBM50459
Substrate
Meas. Tech.
Dose response orthogonal assay of uHTS small molecule inhibitors of Striatal-Enriched Phosphatase via a colorimetric intensity assay.
IC50
42000±n/a nM
Citation
 PubChem, PC Dose response orthogonal assay of uHTS small molecule inhibitors of Striatal-Enriched Phosphatase via a colorimetric intensity assay. PubChem Bioassay (2012)[AID] 
Target
Name:
Tyrosine-protein phosphatase non-receptor type 5
Synonyms:
PTN5_HUMAN Tyrosine-protein phosphatase non-receptor type 5 | Tyrosine-protein phosphatase non-receptor type 5 isoform a
Type:
Enzyme Catalytic Domain
Mol. Mass.:
63510.68
Organism:
Homo sapiens (Human)
Description:
gi_90652859
Residue:
565
  
Inhibitor
Name:
BDBM50459
Synonyms:
MLS000862518 N-[4-[(3,4-dimethyl-1,2-oxazol-5-yl)sulfamoyl]phenyl]-6,8-dimethyl-2-pyridin-2-yl-quinoline-4-carboxamide N-[4-[(3,4-dimethyl-5-isoxazolyl)sulfamoyl]phenyl]-6,8-dimethyl-2-(2-pyridinyl)-4-quinolinecarboxamide SMR000300559 | cid_1261822
Type:
Small organic molecule
Emp. Form.:
C28H25N5O4S
Mol. Mass.:
527.594
SMILES:
Cc1noc(NS(=O)(=O)c2ccc(NC(=O)c3cc(nc4c(C)cc(C)cc34)-c3ccccn3)cc2)c1C
: