Target
Cyclin-dependent kinase 2
Ligand
BDBM7772
Substrate
Meas. Tech.
OctetRed
pH
7.5±n/a
Temperature
298.15±n/a K
Kd
229±79 nM
Citation
 CSARdock, CD CDK2 in CSAR_FULL_RELEASE_3JULY2012 CSAR 1:0 (2012)  
Target
Name:
Cyclin-dependent kinase 2
Synonyms:
CDK2 CDK2_HUMAN Cell division protein kinase 2 Protein cereblon/Cyclin-dependent kinase 2 | p33 protein kinase
Type:
Enzyme Subunit
Mol. Mass.:
33938.17
Organism:
Homo sapiens (Human)
Description:
P24941
Residue:
298
  
Inhibitor
Name:
BDBM7772
Synonyms:
5-({[(12Z)-11-oxo-3-thia-5,10-diazatricyclo[7.3.0.0^{2,6}]dodeca-1,4,6,8-tetraen-12-ylidene]methyl}amino)-1,3-dihydro-2-benzothiophene-2,2-dione CS245 | Oxindole-Based Inhibitor 108
Type:
Small organic molecule
Emp. Form.:
C18H13N3O3S2
Mol. Mass.:
383.444
SMILES:
O=C1Nc2ccc3ncsc3c2C1C=Nc1ccc2CS(=O)(=O)Cc2c1
: