Target
Serine/threonine-protein kinase Chk1
Ligand
BDBM91830
Substrate
Meas. Tech.
Abbott Kinase Enzymatics_CHK1/289 CDC25c
IC50
4±n/a nM
Citation
 CSARdock, CD CHK1 in CSAR_FULL_RELEASE_3JULY2012 CSAR 1:0 (2012)  
Target
Name:
Serine/threonine-protein kinase Chk1
Synonyms:
CHEK1 CHK1 checkpoint homolog Checkpoint kinase-1 (CHK1)
Type:
Enzyme Catalytic Domain
Mol. Mass.:
54443.02
Organism:
Homo sapiens (Human)
Description:
gi_166295192
Residue:
476
  
Inhibitor
Name:
BDBM91830
Synonyms:
Chk1_104
Type:
Emp. Form.:
C29H27N3O3
Mol. Mass.:
465.543
SMILES:
OC1CCC(CC1)NC(=O)c1ccc-2c(Cc3c(n[nH]c-23)-c2ccc(cc2)-c2ccc(O)cc2)c1
: