Target
Indoleamine 2,3-dioxygenase 1
Ligand
BDBM223001
Substrate
Meas. Tech.
Human Indoleamine 2,3-Dioxygenasae (IDO) Enzyme Assay
pH
6.5±n/a
Temperature
298.15±n/a K
IC50
<100.0±n/a nM
Comments
extracted
Citation
 Combs, APYue, EWSparks, RBZhu, W 1,2,5-oxadiazoles as inhibitors of indoleamine 2,3-dioxygenase US Patent  US10034864 Publication Date 7/31/2018 
Target
Name:
Indoleamine 2,3-dioxygenase 1
Synonyms:
I23O1_HUMAN IDO-1 INDO Indoleamine 2,3-dioxygenase | Indoleamine-pyrrole 2,3-dioxygenase
Type:
Enzyme
Mol. Mass.:
45330.80
Organism:
Homo sapiens (Human)
Description:
P14902
Residue:
403
  
Inhibitor
Name:
BDBM223001
Synonyms:
US10034939, Example 3 US9320732, 3 | US9789094, 3
Type:
Small organic molecule
Emp. Form.:
C12H15BrFN7O4S
Mol. Mass.:
452.259
SMILES:
NS(=O)(=O)NCCCNc1nonc1C(Nc1ccc(F)c(Br)c1)=NO
: