Target
Indoleamine 2,3-dioxygenase 1
Ligand
BDBM279193
Substrate
Meas. Tech.
Human Indoleamine 2,3-Dioxygenasae (IDO) Enzyme Assay
pH
6.5±n/a
Temperature
298.15±n/a K
IC50
<750±n/a nM
Comments
extracted
Citation
 Combs, APYue, EWSparks, RBZhu, W 1,2,5-oxadiazoles as inhibitors of indoleamine 2,3-dioxygenase US Patent  US10034864 Publication Date 7/31/2018 
Target
Name:
Indoleamine 2,3-dioxygenase 1
Synonyms:
I23O1_HUMAN IDO-1 INDO Indoleamine 2,3-dioxygenase | Indoleamine-pyrrole 2,3-dioxygenase
Type:
Enzyme
Mol. Mass.:
45330.80
Organism:
Homo sapiens (Human)
Description:
P14902
Residue:
403
  
Inhibitor
Name:
BDBM279193
Synonyms:
4-({2-[(Aminosulfonyl)amino]ethyl}amino)-N-[(4-chloro-2-furyl)methyl]-N'-hydroxy-1,2,5-oxadiazole-3-carboximidamide US10967060, Example 21 US9789094, 21
Type:
Small organic molecule
Emp. Form.:
C10H14ClN7O5S
Mol. Mass.:
379.78
SMILES:
NS(=O)(=O)NCCNc1nonc1C(NCc1cc(Cl)co1)=NO
: