Target
Indoleamine 2,3-dioxygenase 1
Ligand
BDBM279186
Substrate
Meas. Tech.
Human indoleamine 2,3-dioxygenasae (IDO) enzyme assay
pH
6.5±n/a
Temperature
298.15±n/a K
IC50
<200±n/a nM
Comments
extracted
Citation
 Gajewski, TFSpranger, SLeung, M Synergistic combination of immunologic inhibitors for the treatment of cancer US Patent  US10034939 Publication Date 7/31/2018 
Target
Name:
Indoleamine 2,3-dioxygenase 1
Synonyms:
I23O1_HUMAN IDO-1 INDO Indoleamine 2,3-dioxygenase | Indoleamine-pyrrole 2,3-dioxygenase
Type:
Enzyme
Mol. Mass.:
45330.80
Organism:
Homo sapiens (Human)
Description:
P14902
Residue:
403
  
Inhibitor
Name:
BDBM279186
Synonyms:
US10034939, Example 14
Type:
Small organic molecule
Emp. Form.:
C13H15F3N6O4S
Mol. Mass.:
408.356
SMILES:
CS(=O)(=O)NCCNc1nonc1\C(Nc1cccc(c1)C(F)(F)F)=N\O
: