Target
Aurora kinase A
Ligand
BDBM92801
Substrate
Meas. Tech.
In Vitro Enzyme Assay
IC50
19.9±2.2 nM
Citation
 Lawrence, HRMartin, MPLuo, YPireddu, RYang, HGevariya, HOzcan, SZhu, JYKendig, RRodriguez, MElias, RCheng, JQSebti, SMSchonbrunn, ELawrence, NJ Development of o-chlorophenyl substituted pyrimidines as exceptionally potent aurora kinase inhibitors. J Med Chem 55:7392-416 (2012)  
Target
Name:
Aurora kinase A
Synonyms:
AIK ARK-1 AURA AURKA_HUMAN Aurora 2 Aurora kinase A (AURKA) Aurora kinase A (Aurora-2) Aurora/IPL1-related kinase 1 Breast tumor-amplified kinase IAK1 STK15 GN Serine/threonine kinase 15 Serine/threonine-protein kinase 6 Serine/threonine-protein kinase aurora-A aurora-2 | hARK1
Type:
Serine/threonine-protein kinase
Mol. Mass.:
45830.98
Organism:
Homo sapiens (Human)
Description:
O14965
Residue:
403
  
Inhibitor
Name:
BDBM92801
Synonyms:
Bisanilinopyrimidine, 3p | US9249124, 17
Type:
Small molecule
Emp. Form.:
C16H12ClFN4
Mol. Mass.:
314.745
SMILES:
Fc1cnc(Nc2ccccc2)nc1Nc1ccccc1Cl
: