Target
Aurora kinase B
Ligand
BDBM92841
Substrate
Meas. Tech.
In Vitro Enzyme Assay
IC50
10.7±0 nM
Citation
 Lawrence, HRMartin, MPLuo, YPireddu, RYang, HGevariya, HOzcan, SZhu, JYKendig, RRodriguez, MElias, RCheng, JQSebti, SMSchonbrunn, ELawrence, NJ Development of o-chlorophenyl substituted pyrimidines as exceptionally potent aurora kinase inhibitors. J Med Chem 55:7392-416 (2012)  
Target
Name:
Aurora kinase B
Synonyms:
AIK2 AIM1 ARK2 AURKB_HUMAN Aurora B-INCENP Aurora kinase B (AURKB) STK-1 STK12 Serine/threonine-protein kinase aurora B
Type:
Protein
Mol. Mass.:
39327.72
Organism:
Homo sapiens (Human)
Description:
Q96GD4
Residue:
344
  
Inhibitor
Name:
BDBM92841
Synonyms:
Bisanilinopyrimidine, 9m | US9249124, 57
Type:
Small molecule
Emp. Form.:
C17H13ClFN5O
Mol. Mass.:
357.769
SMILES:
NC(=O)c1ccc(Nc2ncc(F)c(Nc3ccccc3Cl)n2)cc1
: