Target
Mitogen-activated protein kinase kinase kinase 5
Ligand
BDBM93207
Substrate
Meas. Tech.
Fluorescence Assay
pH
7.5±0
Temperature
298.15±0 K
IC50
>10000±0.2 nM
Citation
 Brigham, JLPerera, BGMaly, DJ A Hexylchloride-Based Catch-and-Release System for Chemical Proteomic Applications. ACS Chem Biol 8:691-9 (2013)  
Target
Name:
Mitogen-activated protein kinase kinase kinase 5
Synonyms:
ASK1 MAP3K5 MEKK5
Type:
Protein
Mol. Mass.:
154514.93
Organism:
Homo sapiens (Human)
Description:
Q99683
Residue:
1374
  
Inhibitor
Name:
BDBM93207
Synonyms:
Kinase inhibitor, 5
Type:
Small molecule
Emp. Form.:
C31H26F3N5O2
Mol. Mass.:
557.5656
SMILES:
Cc1ccc(NC(=O)c2cccc(c2)C(F)(F)F)cc1-c1ccc2nc(Nc3ccc(OCCN)cc3)ncc2c1
: