Target
Isocitrate dehydrogenase [NADP] cytoplasmic [R132H]
Ligand
BDBM279662
Substrate
Meas. Tech.
Inhibition of Cellular Release of Amyloid Peptide 1-40
IC50
63.0±n/a nM
Citation
 Badiger, SChebrolu, MHurth, KJacquier, SLueoend, RMMachauer, RRueeger, HTintelnot-Blomley, MVeenstra, SJVoegtle, M Heterocyclic derivatives and their use in the treatment of neurological disorders US Patent  US10035794 Publication Date 7/31/2018 
Target
Name:
Isocitrate dehydrogenase [NADP] cytoplasmic [R132H]
Synonyms:
Cytosolic NADP-isocitrate dehydrogenase (IDH1)(R132H) IDH1 R132H IDHC_HUMAN Isocitrate dehydrogenase 1 mutant (R132H) Isocitrate dehydrogenase [NADP] cytoplasmic (IDH1)(R132H) PICD
Type:
Protein
Mol. Mass.:
46641.74
Organism:
Homo sapiens (Human)
Description:
Human IDH1 R132H (SEQ ID No. 2 in patent). First three are removed. Google patent parsed wrong.
Residue:
414
  
Inhibitor
Name:
BDBM279662
Synonyms:
US10035794, Example 6
Type:
Small organic molecule
Emp. Form.:
C17H18ClFN5O2
Mol. Mass.:
378.808
SMILES:
Cc1cc(Cl)cnc1C(=O)Nc1cccc(n1)C1(CF)COCC([NH3+])=N1
: