Target
Receptor-interacting serine/threonine-protein kinase 2
Ligand
BDBM83275
Substrate
IC50
1188±n/a nM
Citation
 PubChem, PC Fluorescence-based cell-based high throughput dose response assay for inhibitors of the interaction of nucleotide-binding oligomerization domain containing 2 (NOD2) and the receptor-interacting serine-threonine kinase 2 (RIPK2) PubChem Bioassay (2012)[AID] 
Target
Name:
Receptor-interacting serine/threonine-protein kinase 2
Synonyms:
CARDIAK RIP2 RIPK2_HUMAN Tyrosine-protein kinase RIPK2 | receptor-interacting serine/threonine-protein kinase 2
Type:
Protein
Mol. Mass.:
61201.30
Organism:
Homo sapiens (Human)
Description:
Residue:
540
  
Inhibitor
Name:
BDBM83275
Synonyms:
MLS002701540 cid_457901
Type:
Small organic molecule
Emp. Form.:
C22H30O7
Mol. Mass.:
406.4694
SMILES:
[H]C12CCC3C(C1O)(C(=O)C2=C)C1(O)OCC32CCCC(C)(COC(C)=O)C2C1O
: