Target
Sentrin-specific protease 8
Ligand
BDBM34462
Substrate
IC50
10800±1280 nM
Citation
 PubChem, PC Dose-response confirmation of uHTS inhibitor hits of Sentrin-Specific Protease 8 using a kinetic assay with Nedd8 Protein Substrate PubChem Bioassay (2012)[AID] 
Target
Name:
Sentrin-specific protease 8
Synonyms:
DEN1 PRSC2 SENP8_HUMAN | SUMO/sentrin specific peptidase family member 8
Type:
Enzyme Catalytic Domain
Mol. Mass.:
24104.52
Organism:
Homo sapiens (Human)
Description:
gi_262118306
Residue:
212
  
Inhibitor
Name:
BDBM34462
Synonyms:
(3,4-dichlorophenyl)-[4-(2-hydroxyethyl)-1-piperazinyl]methanethione (3,4-dichlorophenyl)-[4-(2-hydroxyethyl)piperazino]methanethione MLS000049575 cid_963027
Type:
Small organic molecule
Emp. Form.:
C13H16Cl2N2OS
Mol. Mass.:
319.25
SMILES:
OCCN1CCN(CC1)C(=S)c1ccc(Cl)c(Cl)c1
: