Target
Sentrin-specific protease 8
Ligand
BDBM93563
Substrate
IC50
967±99 nM
Citation
 PubChem, PC Dose-response confirmation of uHTS inhibitor hits of Sentrin-Specific Protease 8 using a kinetic assay with Nedd8 Protein Substrate PubChem Bioassay (2012)[AID] 
Target
Name:
Sentrin-specific protease 8
Synonyms:
DEN1 PRSC2 SENP8_HUMAN | SUMO/sentrin specific peptidase family member 8
Type:
Enzyme Catalytic Domain
Mol. Mass.:
24104.52
Organism:
Homo sapiens (Human)
Description:
gi_262118306
Residue:
212
  
Inhibitor
Name:
BDBM93563
Synonyms:
5-amino-3-(4-chlorophenyl)-4-keto-N-[(E)-p-anisylideneamino]thieno[3,4-d]pyridazine-1-carboxamide 5-amino-3-(4-chlorophenyl)-N-[(E)-(4-methoxyphenyl)methylideneamino]-4-oxo-1-thieno[3,4-d]pyridazinecarboxamide 5-azanyl-3-(4-chlorophenyl)-N-[(E)-(4-methoxyphenyl)methylideneamino]-4-oxidanylidene-thieno[3,4-d]pyridazine-1-carboxamide SMR000164097 | cid_6871358
Type:
Small organic molecule
Emp. Form.:
C21H16ClN5O3S
Mol. Mass.:
453.901
SMILES:
COc1ccc(\C=N\NC(=O)c2nn(-c3ccc(Cl)cc3)c(=O)c3c(N)scc23)cc1
: