Target
Protein Wnt-3a
Ligand
BDBM89237
Substrate
IC50
1700±n/a nM
Citation
 PubChem, PC Dose response validation of uHTS Gli-SUFU antagonist hits in a Wnt3a luminescent reporter assay PubChem Bioassay (2012)[AID] 
Target
Name:
Protein Wnt-3a
Synonyms:
WNT3A_MOUSE Wnt3a | protein Wnt-3a precursor
Type:
PROTEIN
Mol. Mass.:
39269.29
Organism:
Mus musculus
Description:
ChEMBL_813156
Residue:
352
  
Inhibitor
Name:
BDBM89237
Synonyms:
4-[(E)-2-(2,3-dimethoxyphenyl)ethenyl]pyridine;hydrochloride MLS000047753 cid_5338423
Type:
Small organic molecule
Emp. Form.:
C15H15NO2
Mol. Mass.:
241.2851
SMILES:
COc1cccc(\C=C\c2ccncc2)c1OC
: