Target
Low molecular weight phosphotyrosine protein phosphatase
Ligand
BDBM50303183
Substrate
IC50
10440±n/a nM
Citation
 PubChem, PC Dose response confirmation of small molecule inhibitors of Low Molecular Weight Protein Tyrosine Phosphatase, LMPTP, via a fluorescence intensity assay PubChem Bioassay (2012)[AID] 
Target
Name:
Low molecular weight phosphotyrosine protein phosphatase
Synonyms:
3.1.3.2 ACP1 LMW-PTP LMWPTP PPAC_HUMAN low molecular weight phosphotyrosine protein phosphatase isoform c
Type:
Mol. Mass.:
18042.81
Organism:
Homo sapiens (Human)
Description:
P24666
Residue:
158
  
Inhibitor
Name:
BDBM50303183
Synonyms:
2-(4-oxo-5-((1-phenyl-3-p-tolyl-1H-pyrazol-4-yl)methylene)-2-thioxothiazolidin-3-yl)ethanesulfonic acid cid_4064091
Type:
Small organic molecule
Emp. Form.:
C22H19N3O4S3
Mol. Mass.:
485.599
SMILES:
Cc1ccc(cc1)-c1nn(cc1\C=C1/SC(=S)N(CCS(O)(=O)=O)C1=O)-c1ccccc1
: