Target
Cytochrome P450 11B2, mitochondrial
Ligand
BDBM279782
Substrate
Meas. Tech.
G-402 cell line assay
EC50
0.046±n/a nM
Citation
 Aebi, JAmrein, KEChen, JHornsperger, BKuhn, BLiu, YLi, DMaerki, HPMartin, REMayweg, ATan, XWu, JYu, J Spirodiamine derivatives as aldosterone synthase inhibitors US Patent  US10035804 Publication Date 7/31/2018 
Target
Name:
Cytochrome P450 11B2, mitochondrial
Synonyms:
Aldosterone Synthase (CYP11B2) Aldosterone-synthesizing enzyme CYP11B2 Cytochrome P450 11B2 Cytochrome P450 11B2, mitochondrial P-450C18 | Steroid 18-hydroxylase
Type:
Protein
Mol. Mass.:
57582.15
Organism:
Homo sapiens (Human)
Description:
P19099
Residue:
503
  
Inhibitor
Name:
BDBM279782
Synonyms:
US10035804, Example 53
Type:
Small organic molecule
Emp. Form.:
C24H23ClN6O2
Mol. Mass.:
462.931
SMILES:
Cn1cc(cn1)C(=O)N1CC2(C1)CN(C2)c1cncc(c1)N1CCc2cc(Cl)ccc2C1=O
: