Target
Mitochondrial peptide methionine sulfoxide reductase
Ligand
BDBM95450
Substrate
IC50
>155166±n/a nM
Citation
 PubChem, PC Absorbance-based biochemical high throughput dose response assay to identify inhibitors of Methionine sulfoxide reductase A (MsrA) PubChem Bioassay (2013)[AID] 
Target
Name:
Mitochondrial peptide methionine sulfoxide reductase
Synonyms:
MSRA MSRA_BOVIN
Type:
Enzyme Catalytic Domain
Mol. Mass.:
25822.90
Organism:
Bos taurus
Description:
gi_73586699
Residue:
233
  
Inhibitor
Name:
BDBM95450
Synonyms:
(6-methoxy-3-pyridyl)-[2-nitro-4-(trifluoromethyl)phenyl]amine 6-methoxy-N-[2-nitro-4-(trifluoromethyl)phenyl]pyridin-3-amine SMR000688981 | cid_4763948
Type:
Small organic molecule
Emp. Form.:
C13H10F3N3O3
Mol. Mass.:
313.232
SMILES:
COc1ccc(Nc2ccc(cc2[N+]([O-])=O)C(F)(F)F)cn1
: