Target
Neutrophil elastase
Ligand
BDBM405424
Substrate
Meas. Tech.
Enzyme Inhibition Assay
IC50
<1.000±n/a nM
Citation
 Gnamm, COost, TPeters, SRudolf, K Substituted bicyclic dihydropyrimidinones and their use as inhibitors of neutrophil elastase activity US Patent  USRE47493 Publication Date 7/9/2019 
Target
Name:
Neutrophil elastase
Synonyms:
Bone marrow serine protease Coagulation factor X ELANE Elastase HLE Leukocyte elastase Medullasin Neutrophil elastase (HNE) PMN elastase Trypsin
Type:
Enzyme
Mol. Mass.:
28532.38
Organism:
Homo sapiens (Human)
Description:
P08246
Residue:
267
  
Inhibitor
Name:
BDBM405424
Synonyms:
USRE47493, Example 39.12
Type:
Small organic molecule
Emp. Form.:
C26H23F3N4O4S
Mol. Mass.:
544.545
SMILES:
CS(=O)CCNC(=O)N1C(C2=C(CCCC2=O)N(C1=O)c1cccc(c1)C(F)(F)F)c1ccc(cc1)C#N
: