Target
Low molecular weight phosphotyrosine protein phosphatase
Ligand
BDBM94916
Substrate
IC50
9870±n/a nM
Citation
 PubChem, PC Dose response confirmation of small molecule inhibitors of Low Molecular Weight Protein Tyrosine Phosphatase, LMPTP, in an orthogonal absorbance-based assay PubChem Bioassay (2013)[AID] 
Target
Name:
Low molecular weight phosphotyrosine protein phosphatase
Synonyms:
3.1.3.2 ACP1 LMW-PTP LMWPTP PPAC_HUMAN low molecular weight phosphotyrosine protein phosphatase isoform c
Type:
Mol. Mass.:
18042.81
Organism:
Homo sapiens (Human)
Description:
P24666
Residue:
158
  
Inhibitor
Name:
BDBM94916
Synonyms:
4-methyl-2-(4-methyl-1-piperidinyl)-1H-quinolin-5-one 4-methyl-2-(4-methylpiperidino)-1H-quinolin-5-one SMR000128254 | cid_6622554
Type:
Small organic molecule
Emp. Form.:
C16H20N2O
Mol. Mass.:
256.3428
SMILES:
CC1CCN(CC1)c1cc(C)c2c(cccc2=O)[nH]1
: