Target
Tyrosine-protein phosphatase non-receptor type 22
Ligand
BDBM94916
Substrate
IC50
>80000±n/a nM
Citation
 PubChem, PC Dose response confirmation of small molecule inhibitors of Low Molecular Weight Protein Tyrosine Phosphatase, LMPTP, in a fluorescence-based, Lymphoid Phosphatase (PTPN22, LYP-1) selectivity Assay PubChem Bioassay (2013)[AID] 
Target
Name:
Tyrosine-protein phosphatase non-receptor type 22
Synonyms:
3.1.3.48 LyP Lymphoid phosphatase (Lyp) PEST-domain phosphatase PTPN22 Tyrosine-protein phosphatase non-receptor type 22 (LYP) | tyrosine-protein phosphatase non-receptor type 22 isoform 1
Type:
Mol. Mass.:
91712.31
Organism:
Homo sapiens (Human)
Description:
Q9Y2R2
Residue:
807
  
Inhibitor
Name:
BDBM94916
Synonyms:
4-methyl-2-(4-methyl-1-piperidinyl)-1H-quinolin-5-one 4-methyl-2-(4-methylpiperidino)-1H-quinolin-5-one SMR000128254 | cid_6622554
Type:
Small organic molecule
Emp. Form.:
C16H20N2O
Mol. Mass.:
256.3428
SMILES:
CC1CCN(CC1)c1cc(C)c2c(cccc2=O)[nH]1
: