Target
RecBCD enzyme subunit RecD
Ligand
BDBM51256
Substrate
IC50
47123±n/a nM
Citation
 PubChem, PC Absorbance-based bacterial cell-based high throughput dose response assay to identify inhibitors of RecBCD PubChem Bioassay (2013)[AID] 
Target
Name:
RecBCD enzyme subunit RecD
Synonyms:
RECD_ECOLI hopE | recD
Type:
Enzyme Catalytic Domain
Mol. Mass.:
66906.68
Organism:
Escherichia coli str. K-12 substr. MG1655
Description:
gi_16130723
Residue:
608
  
Inhibitor
Name:
BDBM51256
Synonyms:
4-(4-methyl-1-piperazinyl)-7-nitro-3-oxido-2,1,3-benzoxadiazol-3-ium 4-(4-methylpiperazin-1-yl)-7-nitro-3-oxido-2,1,3-benzoxadiazol-3-ium Benzofurazan, 4-(4-methyl-1-piperazinyl)-7-nitro-, 3-oxide SMR000528763 | cid_42640
Type:
Small organic molecule
Emp. Form.:
C11H13N5O4
Mol. Mass.:
279.252
SMILES:
CN1CCN(CC1)c1[cH-]cc([N+]([O-])=O)[c+]2[n-]o[n+](=O)c12
: