Target
T cell receptor alpha variable 4
Ligand
BDBM40697
Substrate
IC50
21601±n/a nM
Citation
 PubChem, PC Fluorescence-based biochemical primary high throughput dose response assay to identify inhibitors of T-cell receptor (TCR)-CD3 interaction using a TAMRA-labeled TCR probe PubChem Bioassay (2013)[AID] 
Target
Name:
T cell receptor alpha variable 4
Synonyms:
TCRAV4S1 TVA4_HUMAN
Type:
Enzyme Catalytic Domain
Mol. Mass.:
12216.28
Organism:
Homo sapiens (Human)
Description:
A0A0B4J268
Residue:
109
  
Inhibitor
Name:
BDBM40697
Synonyms:
4-(2,3-dihydroimidazo[2,1-b][1,3]thiazol-6-yl)-1,2-benzenediol 4-(2,3-dihydroimidazo[2,1-b]thiazol-6-yl)benzene-1,2-diol MLS000530540 cid_877570
Type:
Small organic molecule
Emp. Form.:
C11H10N2O2S
Mol. Mass.:
234.274
SMILES:
Oc1ccc(cc1O)-c1cn2CCSc2n1
: