Target
T cell receptor alpha variable 4
Ligand
BDBM96345
Substrate
IC50
24600±n/a nM
Citation
 PubChem, PC Fluorescence-based biochemical primary high throughput dose response assay to identify inhibitors of T-cell receptor (TCR)-CD3 interaction using a TAMRA-labeled TCR probe PubChem Bioassay (2013)[AID] 
Target
Name:
T cell receptor alpha variable 4
Synonyms:
TCRAV4S1 TVA4_HUMAN
Type:
Enzyme Catalytic Domain
Mol. Mass.:
12216.28
Organism:
Homo sapiens (Human)
Description:
A0A0B4J268
Residue:
109
  
Inhibitor
Name:
BDBM96345
Synonyms:
2-hydroxy-3,5,7-trimethylol-cyclohepta-2,4,6-trien-1-one 2-hydroxy-3,5,7-tris(hydroxymethyl)cyclohepta-2,4,6-trien-1-one MLS000766751 cid_741311
Type:
Small organic molecule
Emp. Form.:
C10H12O5
Mol. Mass.:
212.1993
SMILES:
OCc1cc(CO)c(O)c(=O)c(CO)c1
: