Target
T cell receptor alpha variable 4
Ligand
BDBM96352
Substrate
IC50
>94046±n/a nM
Citation
 PubChem, PC Fluorescence-based biochemical primary high throughput dose response assay to identify inhibitors of T-cell receptor (TCR)-CD3 interaction using a TAMRA-labeled TCR probe PubChem Bioassay (2013)[AID] 
Target
Name:
T cell receptor alpha variable 4
Synonyms:
TCRAV4S1 TVA4_HUMAN
Type:
Enzyme Catalytic Domain
Mol. Mass.:
12216.28
Organism:
Homo sapiens (Human)
Description:
A0A0B4J268
Residue:
109
  
Inhibitor
Name:
BDBM96352
Synonyms:
2-methyl-3-[[(E)-(5-methyl-3-nitro-6-oxidanylidene-cyclohexa-2,4-dien-1-ylidene)methyl]amino]quinazolin-4-one 2-methyl-3-[[(E)-(5-methyl-3-nitro-6-oxocyclohexa-2,4-dien-1-ylidene)methyl]amino]quinazolin-4-one 3-{[1-(2-Hydroxy-3-methyl-5-nitro-phenyl)-meth-(E)-ylidene]-amino}-2-methyl-3H-quinazolin-4-one SMR000415515 | cid_5422717
Type:
Small organic molecule
Emp. Form.:
C17H14N4O4
Mol. Mass.:
338.3175
SMILES:
Cc1nc2ccccc2c(=O)n1\[NH+]=C\[c-]1cc(cc(C)c1=O)[N+]([O-])=O
: