Target
T cell receptor alpha variable 4
Ligand
BDBM59075
Substrate
IC50
6031±n/a nM
Citation
 PubChem, PC Fluorescence-based biochemical primary high throughput dose response assay to identify inhibitors of T-cell receptor (TCR)-CD3 interaction using a TAMRA-labeled TCR probe PubChem Bioassay (2013)[AID] 
Target
Name:
T cell receptor alpha variable 4
Synonyms:
TCRAV4S1 TVA4_HUMAN
Type:
Enzyme Catalytic Domain
Mol. Mass.:
12216.28
Organism:
Homo sapiens (Human)
Description:
A0A0B4J268
Residue:
109
  
Inhibitor
Name:
BDBM59075
Synonyms:
3-[2-[4-(2,3-dihydro-1,4-benzodioxin-3-carbonyl)piperazino]-2-keto-ethyl]-7,8-dihydroxy-4-methyl-coumarin 3-[2-[4-(2,3-dihydro-1,4-benzodioxine-3-carbonyl)piperazin-1-yl]-2-oxoethyl]-7,8-dihydroxy-4-methylchromen-2-one MLS001032378 cid_16422045
Type:
Small organic molecule
Emp. Form.:
C25H24N2O8
Mol. Mass.:
480.4667
SMILES:
Cc1c(CC(=O)N2CCN(CC2)C(=O)C2COc3ccccc3O2)c(=O)oc2c(O)c(O)ccc12
: