Target
T cell receptor alpha variable 4
Ligand
BDBM61886
Substrate
IC50
>94047±n/a nM
Citation
 PubChem, PC Fluorescence-based biochemical primary high throughput dose response assay to identify inhibitors of T-cell receptor (TCR)-CD3 interaction using a TAMRA-labeled TCR probe PubChem Bioassay (2013)[AID] 
Target
Name:
T cell receptor alpha variable 4
Synonyms:
TCRAV4S1 TVA4_HUMAN
Type:
Enzyme Catalytic Domain
Mol. Mass.:
12216.28
Organism:
Homo sapiens (Human)
Description:
A0A0B4J268
Residue:
109
  
Inhibitor
Name:
BDBM61886
Synonyms:
2-fluoranyl-N'-(3-pyrrol-1-ylphenyl)carbonyl-benzohydrazide 2-fluoro-N'-[oxo-[3-(1-pyrrolyl)phenyl]methyl]benzohydrazide SMR000708835 | cid_24979922
Type:
Small organic molecule
Emp. Form.:
C18H14FN3O2
Mol. Mass.:
323.3211
SMILES:
Fc1ccccc1C(=O)NNC(=O)c1cccc(c1)-n1cccc1
: